{"text_format":"1","workbook":"xlsx","n_sheets":9,"sheets":["Macro","Site Details","Loop1","Loop2","Loop3","Loop4","Device QTY","Help","Parameters"],"not_rendered":{"charts":0,"images":12,"macros":1,"external_links":0,"defined_names":9,"comments":5,"pivot_tables":0},"unopened":[],"bounds":{"document_bytes":16777216,"sheet_cells":100000,"rows_first":2000,"rows_last":500,"rows_between":2000,"halvings":0,"cell_chars":16384,"cell_head_chars":4096},"cells_cut":0,"cells_raw":0,"read":"whole","date_system":"1900"}

{"sheet":"Macro","index":0,"n_rows":0,"n_cols":0,"rows_kept":0,"cut":false,"hidden":false,"merged":[]}

{"sheet":"Site Details","index":1,"n_rows":7,"n_cols":3,"rows_kept":7,"cut":false,"hidden":true,"merged":[[6,2,6,6],[1,1,1,6],[2,2,2,6],[3,2,3,6],[4,2,4,6],[5,2,5,6]]}
[]
[null,"Details"]
[null,"CONTACT NAME:-",""]
[null,"CONTACT NUMBER:-",""]
[null,"COMPANY NAME:-                                        ",""]
[null,"SITE NAME:-",""]
[null,"SITE ADDRESS:-",""]

{"sheet":"Loop1","index":2,"n_rows":144,"n_cols":14,"rows_kept":144,"cut":false,"hidden":true,"merged":[[2,1,2,6],[7,2,7,6],[3,2,3,6],[4,2,4,6],[5,2,5,6],[6,2,6,6]]}
[null,{"$f":"\"Build Version: \" & Parameters!$D$2","v":"Build Version: 5"},null,null,"LOOP 1"]
[]
[null,"Details"]
[null,"CONTACT NAME:-",{"$f":"IF(LEN('Site Details'!$C$3:$G$3)>0,'Site Details'!$C$3:$G$3,\"\")","v":""}]
[null,"CONTACT NUMBER:-",{"$f":"IF(LEN('Site Details'!$C$4:$G$4)>0,'Site Details'!$C$4:$G$4,\"\")","v":""}]
[null,"COMPANY NAME:-                                        ",{"$f":"IF(LEN('Site Details'!$C$5:$G$5)>0,'Site Details'!$C$5:$G$5,\"\")","v":""}]
[null,"SITE NAME:-",{"$f":"IF(LEN('Site Details'!$C$6:$G$6)>0,'Site Details'!$C$6:$G$6,\"\")","v":""}]
[null,"SITE ADDRESS:-",{"$f":"IF(LEN('Site Details'!$C$7:$G$7)>0,'Site Details'!$C$7:$G$7,\"\")","v":""}]
[]
[null,"Example"]
["Device\nAddress\nNumber","Device Type","Associated\nRCC\nNumber\n1-31",null,"Loop Number","Zone Number","LOCATION TEXT                                                                                                 MAX 40 CHARACTERS "]
[1,"Wireless Call Point",1,null,1,1,"GROUND FLOOR RECEPTION AREA"]
[2,"Wireless Radio Sounder",1,null,1,1,"GROUND FLOOR RECEPTION AREA"]
[3,"Wireless Optical Detector",1,null,1,1,"MAIN ENTRANCE LOBBY"]
[4,"Wireless Combined Detector Sounder",1,null,1,2,"FIRST FLOOR LANDING"]
[5,"Wireless Combined Optical Detector",null,null,1,2,"FIRST FLOOR LANDING"]
[]
["Device Address Number","Device Type","Associated\nRCC\nNumber\n1-31",null,"Loop Number","Zone Number","LOCATION TEXT                                                                                                 MAX 40 CHARACTERS ","Additional Comments",null,null,null,null,"Type","Qty"]
[1,null,null,null,1,null,null,null,null,null,null,null,"Wireless Call Point",{"$f":"COUNTIF($B$19:$B$144,M19)","v":0}]
[2,null,null,null,1,null,null,null,null,null,null,null,"Wireless Optical Detector",{"$f":"COUNTIF($B$19:$B$144,M20)","v":0}]
[3,null,null,null,1,null,null,null,null,null,null,null,"Wireless Heat Detector CS",0]
[4,null,null,null,1,null,null,null,null,null,null,null,"Wireless Heat Detector A1R",{"$f":"COUNTIF($B$19:$B$144,M22)","v":0}]
[5,null,null,null,1,null,null,null,null,null,null,null,"Wireless Multisensor",{"$f":"COUNTIF($B$19:$B$144,M23)","v":0}]
[6,null,null,null,1,null,null,null,null,null,null,null,"Wireless Input Output Unit",{"$f":"COUNTIF($B$19:$B$144,M24)","v":0}]
[7,null,null,null,1,null,null,null,null,null,null,null,"Wireless Combined Detector Sounder",0]
[8,null,null,null,1,null,null,null,null,null,null,null,"Wireless Combined Optical Detector",0]
[9,null,null,null,1,null,null,null,null,null,null,null,"Wireless Combined Heat Detector CS",0]
[10,null,null,null,1,null,null,null,null,null,null,null,"Wireless Combined Heat Detector A1R",0]
[11,null,null,null,1,null,null,null,null,null,null,null,"Wireless Combined Multisensor",0]
[12,null,null,null,1,null,null,null,null,null,null,null,"Wireless Combined Detector Sounder - Visual Indicator",0]
{"$rows_left_out":115}
{"sheet":"Loop2","index":3,"n_rows":144,"n_cols":14,"rows_kept":144,"cut":false,"hidden":true,"merged":[[7,2,7,6],[2,1,2,6],[3,2,3,6],[4,2,4,6],[5,2,5,6],[6,2,6,6]]}
[null,{"$f":"\"Build Version: \" & Parameters!$D$2","v":"Build Version: 5"},null,null,"LOOP 2"]
[]
[null,"Details"]
[null,"CONTACT NAME:-",{"$f":"IF(LEN(Loop1!C4)>0,Loop1!C4,\"\")","v":""}]
[null,"CONTACT NUMBER:-",{"$f":"IF(LEN(Loop1!C5)>0,Loop1!C5,\"\")","v":""}]
[null,"COMPANY NAME:-                                        ",{"$f":"IF(LEN(Loop1!C6)>0,Loop1!C6,\"\")","v":""}]
[null,"SITE NAME:-",{"$f":"IF(LEN(Loop1!C7)>0,Loop1!C7,\"\")","v":""}]
[null,"SITE ADDRESS:-",{"$f":"IF(LEN(Loop1!C8)>0,Loop1!C8,\"\")","v":""}]
[]
[null,"Example"]
[null,"Device Type","Associated\nRCC\nNumber\n1-31","Device Address Number","Loop Number","Zone Number","LOCATION TEXT                                                                                                 MAX 40 CHARACTERS "]
[null,"Wireless Call Point",1,1,1,1,"GROUND FLOOR RECEPTION AREA"]
[null,"Wireless Radio Sounder",1,2,1,1,"GROUND FLOOR RECEPTION AREA"]
[null,"Wireless Optical Detector",1,3,1,1,"MAIN ENTRANCE LOBBY"]
[null,"Wireless Combined Detector Sounder",1,4,1,2,"FIRST FLOOR LANDING"]
[null,"Wireless Combined Optical Detector",null,5,1,2,"FIRST FLOOR LANDING"]
[]
["Device Address Number","Device Type","Associated\nRCC\nNumber\n1-31",null,"Loop Number","Zone Number","LOCATION TEXT                                                                                                 MAX 40 CHARACTERS ","Additional Comments",null,null,null,null,"Type","Qty"]
[1,null,null,null,2,null,null,null,null,null,null,null,"Wireless Call Point",{"$f":"COUNTIF($B$19:$B$144,M19)","v":0}]
[2,null,null,null,2,null,null,null,null,null,null,null,"Wireless Optical Detector",0]
[3,null,null,null,2,null,null,null,null,null,null,null,"Wireless Heat Detector CS",0]
[4,null,null,null,2,null,null,null,null,null,null,null,"Wireless Heat Detector A1R",0]
[5,null,null,null,2,null,null,null,null,null,null,null,"Wireless Multisensor",0]
[6,null,null,null,2,null,null,null,null,null,null,null,"Wireless Input Output Unit",0]
[7,null,null,null,2,null,null,null,null,null,null,null,"Wireless Combined Detector Sounder",0]
[8,null,null,null,2,null,null,null,null,null,null,null,"Wireless Combined Optical Detector",0]
[9,null,null,null,2,null,null,null,null,null,null,null,"Wireless Combined Heat Detector CS",0]
[10,null,null,null,2,null,null,null,null,null,null,null,"Wireless Combined Heat Detector A1R",0]
[11,null,null,null,2,null,null,null,null,null,null,null,"Wireless Combined Multisensor",0]
[12,null,null,null,2,null,null,null,null,null,null,null,"Wireless Combined Detector Sounder - Visual Indicator",0]
{"$rows_left_out":115}
{"sheet":"Loop3","index":4,"n_rows":144,"n_cols":14,"rows_kept":144,"cut":false,"hidden":true,"merged":[[7,2,7,6],[2,1,2,6],[3,2,3,6],[4,2,4,6],[5,2,5,6],[6,2,6,6]]}
[null,{"$f":"\"Build Version: \" & Parameters!$D$2","v":"Build Version: 5"},null,null,"LOOP 3"]
[]
[null,"Details"]
[null,"CONTACT NAME:-",{"$f":"IF(LEN(Loop1!C4)>0,Loop1!C4,\"\")","v":""}]
[null,"CONTACT NUMBER:-",{"$f":"IF(LEN(Loop1!C5)>0,Loop1!C5,\"\")","v":""}]
[null,"COMPANY NAME:-                                        ",{"$f":"IF(LEN(Loop1!C6)>0,Loop1!C6,\"\")","v":""}]
[null,"SITE NAME:-",{"$f":"IF(LEN(Loop1!C7)>0,Loop1!C7,\"\")","v":""}]
[null,"SITE ADDRESS:-",{"$f":"IF(LEN(Loop1!C8)>0,Loop1!C8,\"\")","v":""}]
[]
[null,"Example"]
[null,"Device Type","Associated\nRCC\nNumber\n1-31","Device Address Number","Loop Number","Zone Number","LOCATION TEXT                                                                                                 MAX 40 CHARACTERS "]
[null,"Wireless Call Point",1,1,1,1,"GROUND FLOOR RECEPTION AREA"]
[null,"Wireless Radio Sounder",1,2,1,1,"GROUND FLOOR RECEPTION AREA"]
[null,"Wireless Optical Detector",1,3,1,1,"MAIN ENTRANCE LOBBY"]
[null,"Wireless Combined Detector Sounder",1,4,1,2,"FIRST FLOOR LANDING"]
[null,"Wireless Combined Optical Detector",null,5,1,2,"FIRST FLOOR LANDING"]
[]
["Device Address Number","Device Type","Associated\nRCC\nNumber\n1-31",null,"Loop Number","Zone Number","LOCATION TEXT                                                                                                 MAX 40 CHARACTERS ","Additional Comments",null,null,null,null,"Type","Qty"]
[1,null,null,null,3,null,null,null,null,null,null,null,"Wireless Call Point",{"$f":"COUNTIF($B$19:$B$144,M19)","v":0}]
[2,null,null,null,3,null,null,null,null,null,null,null,"Wireless Optical Detector",{"$f":"COUNTIF($B$19:$B$144,M20)","v":0}]
[3,null,null,null,3,null,null,null,null,null,null,null,"Wireless Heat Detector CS",0]
[4,null,null,null,3,null,null,null,null,null,null,null,"Wireless Heat Detector A1R",0]
[5,null,null,null,3,null,null,null,null,null,null,null,"Wireless Multisensor",0]
[6,null,null,null,3,null,null,null,null,null,null,null,"Wireless Input Output Unit",{"$f":"COUNTIF($B$19:$B$144,M24)","v":0}]
[7,null,null,null,3,null,null,null,null,null,null,null,"Wireless Combined Detector Sounder",0]
[8,null,null,null,3,null,null,null,null,null,null,null,"Wireless Combined Optical Detector",0]
[9,null,null,null,3,null,null,null,null,null,null,null,"Wireless Combined Heat Detector CS",0]
[10,null,null,null,3,null,null,null,null,null,null,null,"Wireless Combined Heat Detector A1R",0]
[11,null,null,null,3,null,null,null,null,null,null,null,"Wireless Combined Multisensor",0]
[12,null,null,null,3,null,null,null,null,null,null,null,"Wireless Combined Detector Sounder - Visual Indicator",0]
{"$rows_left_out":115}
{"sheet":"Loop4","index":5,"n_rows":144,"n_cols":14,"rows_kept":144,"cut":false,"hidden":true,"merged":[[7,2,7,6],[2,1,2,6],[3,2,3,6],[4,2,4,6],[5,2,5,6],[6,2,6,6]]}
[null,{"$f":"\"Build Version: \" & Parameters!$D$2","v":"Build Version: 5"},null,null,"LOOP 4"]
[]
[null,"Details"]
[null,"CONTACT NAME:-",{"$f":"IF(LEN(Loop1!C4)>0,Loop1!C4,\"\")","v":""}]
[null,"CONTACT NUMBER:-",{"$f":"IF(LEN(Loop1!C5)>0,Loop1!C5,\"\")","v":""}]
[null,"COMPANY NAME:-                                        ",{"$f":"IF(LEN(Loop1!C6)>0,Loop1!C6,\"\")","v":""}]
[null,"SITE NAME:-",{"$f":"IF(LEN(Loop1!C7)>0,Loop1!C7,\"\")","v":""}]
[null,"SITE ADDRESS:-",{"$f":"IF(LEN(Loop1!C8)>0,Loop1!C8,\"\")","v":""}]
[]
[null,"Example"]
[null,"Device Type","Associated\nRCC\nNumber\n1-31","Device Address Number","Loop Number","Zone Number","LOCATION TEXT                                                                                                 MAX 40 CHARACTERS "]
[null,"Wireless Call Point",1,1,1,1,"GROUND FLOOR RECEPTION AREA"]
[null,"Wireless Radio Sounder",1,2,1,1,"GROUND FLOOR RECEPTION AREA"]
[null,"Wireless Optical Detector",1,3,1,1,"MAIN ENTRANCE LOBBY"]
[null,"Wireless Combined Detector Sounder",1,4,1,2,"FIRST FLOOR LANDING"]
[null,"Wireless Combined Optical Detector",null,5,1,2,"FIRST FLOOR LANDING"]
[]
["Device Address Number","Device Type","Associated\nRCC\nNumber\n1-31",null,"Loop Number","Zone Number","LOCATION TEXT                                                                                                 MAX 40 CHARACTERS ","Additional Comments",null,null,null,null,"Type","Qty"]
[1,null,null,null,4,null,null,null,null,null,null,null,"Wireless Call Point",{"$f":"COUNTIF($B$19:$B$144,M19)","v":0}]
[2,null,null,null,4,null,null,null,null,null,null,null,"Wireless Optical Detector",{"$f":"COUNTIF($B$19:$B$144,M20)","v":0}]
[3,null,null,null,4,null,null,null,null,null,null,null,"Wireless Heat Detector CS",0]
[4,null,null,null,4,null,null,null,null,null,null,null,"Wireless Heat Detector A1R",0]
[5,null,null,null,4,null,null,null,null,null,null,null,"Wireless Multisensor",0]
[6,null,null,null,4,null,null,null,null,null,null,null,"Wireless Input Output Unit",{"$f":"COUNTIF($B$19:$B$144,M24)","v":0}]
[7,null,null,null,4,null,null,null,null,null,null,null,"Wireless Combined Detector Sounder",0]
[8,null,null,null,4,null,null,null,null,null,null,null,"Wireless Combined Optical Detector",0]
[9,null,null,null,4,null,null,null,null,null,null,null,"Wireless Combined Heat Detector CS",0]
[10,null,null,null,4,null,null,null,null,null,null,null,"Wireless Combined Heat Detector A1R",0]
[11,null,null,null,4,null,null,null,null,null,null,null,"Wireless Combined Multisensor",0]
[12,null,null,null,4,null,null,null,null,null,null,null,"Wireless Combined Detector Sounder - Visual Indicator",0]
{"$rows_left_out":115}
{"sheet":"Device QTY","index":6,"n_rows":36,"n_cols":6,"rows_kept":36,"cut":false,"hidden":true,"merged":[[6,1,6,9],[1,0,1,9],[2,1,2,9],[3,1,3,9],[4,1,4,9],[5,1,5,9]]}
[{"$f":"\"Build Version: \" & Parameters!$D$2","v":"Build Version: 5"}]
["Details"]
["CONTACT NAME:-",{"$f":"IF(LEN(Loop1!C4)>0,Loop1!C4,\"\")","v":""}]
["CONTACT NUMBER:-",{"$f":"IF(LEN(Loop1!C5)>0,Loop1!C5,\"\")","v":""}]
["COMPANY NAME:-                                        ",{"$f":"IF(LEN(Loop1!C6)>0,Loop1!C6,\"\")","v":""}]
["SITE NAME:-",{"$f":"IF(LEN(Loop1!C7)>0,Loop1!C7,\"\")","v":""}]
["SITE ADDRESS:-",{"$f":"IF(LEN(Loop1!C8)>0,Loop1!C8,\"\")","v":""}]
[]
["Type","Loop 1 ","Loop 2","Loop 3","Loop 4","Totals"]
["Wireless Call Point",{"$f":"IF(ISNA(VLOOKUP($A10,Loop1!$M$19:$N$45,2,FALSE)),0,VLOOKUP($A10,Loop1!$M$19:$N$45,2,FALSE))","v":0},{"$f":"IF(ISNA(VLOOKUP($A10,Loop2!$M$19:$N$45,2,FALSE)),0,VLOOKUP($A10,Loop2!$M$19:$N$45,2,FALSE))","v":0},{"$f":"IF(ISNA(VLOOKUP($A10,Loop3!$M$19:$N$45,2,FALSE)),0,VLOOKUP($A10,Loop3!$M$19:$N$45,2,FALSE))","v":0},{"$f":"IF(ISNA(VLOOKUP($A10,Loop4!$M$19:$N$45,2,FALSE)),0,VLOOKUP($A10,Loop4!$M$19:$N$45,2,FALSE))","v":0},{"$f":"SUM(B10:E10)","v":0}]
["Wireless Optical Detector",{"$f":"IF(ISNA(VLOOKUP($A11,Loop1!$M$19:$N$45,2,FALSE)),0,VLOOKUP($A11,Loop1!$M$19:$N$45,2,FALSE))","v":0},{"$f":"IF(ISNA(VLOOKUP($A11,Loop2!$M$19:$N$45,2,FALSE)),0,VLOOKUP($A11,Loop2!$M$19:$N$45,2,FALSE))","v":0},{"$f":"IF(ISNA(VLOOKUP($A11,Loop3!$M$19:$N$45,2,FALSE)),0,VLOOKUP($A11,Loop3!$M$19:$N$45,2,FALSE))","v":0},{"$f":"IF(ISNA(VLOOKUP($A11,Loop4!$M$19:$N$45,2,FALSE)),0,VLOOKUP($A11,Loop4!$M$19:$N$45,2,FALSE))","v":0},{"$f":"SUM(B11:E11)","v":0}]
["Wireless Heat Detector CS",{"$f":"IF(ISNA(VLOOKUP($A12,Loop1!$M$19:$N$45,2,FALSE)),0,VLOOKUP($A12,Loop1!$M$19:$N$45,2,FALSE))","v":0},{"$f":"IF(ISNA(VLOOKUP($A12,Loop2!$M$19:$N$45,2,FALSE)),0,VLOOKUP($A12,Loop2!$M$19:$N$45,2,FALSE))","v":0},{"$f":"IF(ISNA(VLOOKUP($A12,Loop3!$M$19:$N$45,2,FALSE)),0,VLOOKUP($A12,Loop3!$M$19:$N$45,2,FALSE))","v":0},{"$f":"IF(ISNA(VLOOKUP($A12,Loop4!$M$19:$N$45,2,FALSE)),0,VLOOKUP($A12,Loop4!$M$19:$N$45,2,FALSE))","v":0},0]
["Wireless Heat Detector A1R",{"$f":"IF(ISNA(VLOOKUP($A13,Loop1!$M$19:$N$45,2,FALSE)),0,VLOOKUP($A13,Loop1!$M$19:$N$45,2,FALSE))","v":0},{"$f":"IF(ISNA(VLOOKUP($A13,Loop2!$M$19:$N$45,2,FALSE)),0,VLOOKUP($A13,Loop2!$M$19:$N$45,2,FALSE))","v":0},{"$f":"IF(ISNA(VLOOKUP($A13,Loop3!$M$19:$N$45,2,FALSE)),0,VLOOKUP($A13,Loop3!$M$19:$N$45,2,FALSE))","v":0},{"$f":"IF(ISNA(VLOOKUP($A13,Loop4!$M$19:$N$45,2,FALSE)),0,VLOOKUP($A13,Loop4!$M$19:$N$45,2,FALSE))","v":0},0]
["Wireless Multisensor",{"$f":"IF(ISNA(VLOOKUP($A14,Loop1!$M$19:$N$45,2,FALSE)),0,VLOOKUP($A14,Loop1!$M$19:$N$45,2,FALSE))","v":0},{"$f":"IF(ISNA(VLOOKUP($A14,Loop2!$M$19:$N$45,2,FALSE)),0,VLOOKUP($A14,Loop2!$M$19:$N$45,2,FALSE))","v":0},{"$f":"IF(ISNA(VLOOKUP($A14,Loop3!$M$19:$N$45,2,FALSE)),0,VLOOKUP($A14,Loop3!$M$19:$N$45,2,FALSE))","v":0},{"$f":"IF(ISNA(VLOOKUP($A14,Loop4!$M$19:$N$45,2,FALSE)),0,VLOOKUP($A14,Loop4!$M$19:$N$45,2,FALSE))","v":0},0]
["Wireless Input Output Unit",{"$f":"IF(ISNA(VLOOKUP($A15,Loop1!$M$19:$N$45,2,FALSE)),0,VLOOKUP($A15,Loop1!$M$19:$N$45,2,FALSE))","v":0},{"$f":"IF(ISNA(VLOOKUP($A15,Loop2!$M$19:$N$45,2,FALSE)),0,VLOOKUP($A15,Loop2!$M$19:$N$45,2,FALSE))","v":0},{"$f":"IF(ISNA(VLOOKUP($A15,Loop3!$M$19:$N$45,2,FALSE)),0,VLOOKUP($A15,Loop3!$M$19:$N$45,2,FALSE))","v":0},{"$f":"IF(ISNA(VLOOKUP($A15,Loop4!$M$19:$N$45,2,FALSE)),0,VLOOKUP($A15,Loop4!$M$19:$N$45,2,FALSE))","v":0},0]
["Wireless Combined Detector Sounder",{"$f":"IF(ISNA(VLOOKUP($A16,Loop1!$M$19:$N$45,2,FALSE)),0,VLOOKUP($A16,Loop1!$M$19:$N$45,2,FALSE))","v":0},{"$f":"IF(ISNA(VLOOKUP($A16,Loop2!$M$19:$N$45,2,FALSE)),0,VLOOKUP($A16,Loop2!$M$19:$N$45,2,FALSE))","v":0},{"$f":"IF(ISNA(VLOOKUP($A16,Loop3!$M$19:$N$45,2,FALSE)),0,VLOOKUP($A16,Loop3!$M$19:$N$45,2,FALSE))","v":0},{"$f":"IF(ISNA(VLOOKUP($A16,Loop4!$M$19:$N$45,2,FALSE)),0,VLOOKUP($A16,Loop4!$M$19:$N$45,2,FALSE))","v":0},0]
["Wireless Combined Optical Detector",{"$f":"IF(ISNA(VLOOKUP($A17,Loop1!$M$19:$N$45,2,FALSE)),0,VLOOKUP($A17,Loop1!$M$19:$N$45,2,FALSE))","v":0},{"$f":"IF(ISNA(VLOOKUP($A17,Loop2!$M$19:$N$45,2,FALSE)),0,VLOOKUP($A17,Loop2!$M$19:$N$45,2,FALSE))","v":0},{"$f":"IF(ISNA(VLOOKUP($A17,Loop3!$M$19:$N$45,2,FALSE)),0,VLOOKUP($A17,Loop3!$M$19:$N$45,2,FALSE))","v":0},{"$f":"IF(ISNA(VLOOKUP($A17,Loop4!$M$19:$N$45,2,FALSE)),0,VLOOKUP($A17,Loop4!$M$19:$N$45,2,FALSE))","v":0},0]
["Wireless Combined Heat Detector CS",{"$f":"IF(ISNA(VLOOKUP($A18,Loop1!$M$19:$N$45,2,FALSE)),0,VLOOKUP($A18,Loop1!$M$19:$N$45,2,FALSE))","v":0},{"$f":"IF(ISNA(VLOOKUP($A18,Loop2!$M$19:$N$45,2,FALSE)),0,VLOOKUP($A18,Loop2!$M$19:$N$45,2,FALSE))","v":0},{"$f":"IF(ISNA(VLOOKUP($A18,Loop3!$M$19:$N$45,2,FALSE)),0,VLOOKUP($A18,Loop3!$M$19:$N$45,2,FALSE))","v":0},{"$f":"IF(ISNA(VLOOKUP($A18,Loop4!$M$19:$N$45,2,FALSE)),0,VLOOKUP($A18,Loop4!$M$19:$N$45,2,FALSE))","v":0},0]
["Wireless Combined Heat Detector A1R",{"$f":"IF(ISNA(VLOOKUP($A19,Loop1!$M$19:$N$45,2,FALSE)),0,VLOOKUP($A19,Loop1!$M$19:$N$45,2,FALSE))","v":0},{"$f":"IF(ISNA(VLOOKUP($A19,Loop2!$M$19:$N$45,2,FALSE)),0,VLOOKUP($A19,Loop2!$M$19:$N$45,2,FALSE))","v":0},{"$f":"IF(ISNA(VLOOKUP($A19,Loop3!$M$19:$N$45,2,FALSE)),0,VLOOKUP($A19,Loop3!$M$19:$N$45,2,FALSE))","v":0},{"$f":"IF(ISNA(VLOOKUP($A19,Loop4!$M$19:$N$45,2,FALSE)),0,VLOOKUP($A19,Loop4!$M$19:$N$45,2,FALSE))","v":0},0]
["Wireless Combined Multisensor",{"$f":"IF(ISNA(VLOOKUP($A20,Loop1!$M$19:$N$45,2,FALSE)),0,VLOOKUP($A20,Loop1!$M$19:$N$45,2,FALSE))","v":0},{"$f":"IF(ISNA(VLOOKUP($A20,Loop2!$M$19:$N$45,2,FALSE)),0,VLOOKUP($A20,Loop2!$M$19:$N$45,2,FALSE))","v":0},{"$f":"IF(ISNA(VLOOKUP($A20,Loop3!$M$19:$N$45,2,FALSE)),0,VLOOKUP($A20,Loop3!$M$19:$N$45,2,FALSE))","v":0},{"$f":"IF(ISNA(VLOOKUP($A20,Loop4!$M$19:$N$45,2,FALSE)),0,VLOOKUP($A20,Loop4!$M$19:$N$45,2,FALSE))","v":0},0]
["Wireless Combined Detector Sounder - Visual Indicator",{"$f":"IF(ISNA(VLOOKUP($A21,Loop1!$M$19:$N$45,2,FALSE)),0,VLOOKUP($A21,Loop1!$M$19:$N$45,2,FALSE))","v":0},{"$f":"IF(ISNA(VLOOKUP($A21,Loop2!$M$19:$N$45,2,FALSE)),0,VLOOKUP($A21,Loop2!$M$19:$N$45,2,FALSE))","v":0},{"$f":"IF(ISNA(VLOOKUP($A21,Loop3!$M$19:$N$45,2,FALSE)),0,VLOOKUP($A21,Loop3!$M$19:$N$45,2,FALSE))","v":0},{"$f":"IF(ISNA(VLOOKUP($A21,Loop4!$M$19:$N$45,2,FALSE)),0,VLOOKUP($A21,Loop4!$M$19:$N$45,2,FALSE))","v":0},0]
["Wireless Combined Visual Indicator - Optical Detector",{"$f":"IF(ISNA(VLOOKUP($A22,Loop1!$M$19:$N$45,2,FALSE)),0,VLOOKUP($A22,Loop1!$M$19:$N$45,2,FALSE))","v":0},{"$f":"IF(ISNA(VLOOKUP($A22,Loop2!$M$19:$N$45,2,FALSE)),0,VLOOKUP($A22,Loop2!$M$19:$N$45,2,FALSE))","v":0},{"$f":"IF(ISNA(VLOOKUP($A22,Loop3!$M$19:$N$45,2,FALSE)),0,VLOOKUP($A22,Loop3!$M$19:$N$45,2,FALSE))","v":0},{"$f":"IF(ISNA(VLOOKUP($A22,Loop4!$M$19:$N$45,2,FALSE)),0,VLOOKUP($A22,Loop4!$M$19:$N$45,2,FALSE))","v":0},0]
["Wireless Combined Visual Indicator - Heat Detector CS",{"$f":"IF(ISNA(VLOOKUP($A23,Loop1!$M$19:$N$45,2,FALSE)),0,VLOOKUP($A23,Loop1!$M$19:$N$45,2,FALSE))","v":0},{"$f":"IF(ISNA(VLOOKUP($A23,Loop2!$M$19:$N$45,2,FALSE)),0,VLOOKUP($A23,Loop2!$M$19:$N$45,2,FALSE))","v":0},{"$f":"IF(ISNA(VLOOKUP($A23,Loop3!$M$19:$N$45,2,FALSE)),0,VLOOKUP($A23,Loop3!$M$19:$N$45,2,FALSE))","v":0},{"$f":"IF(ISNA(VLOOKUP($A23,Loop4!$M$19:$N$45,2,FALSE)),0,VLOOKUP($A23,Loop4!$M$19:$N$45,2,FALSE))","v":0},0]
["Wireless Combined Visual Indicator - Heat Detector A1R",{"$f":"IF(ISNA(VLOOKUP($A24,Loop1!$M$19:$N$45,2,FALSE)),0,VLOOKUP($A24,Loop1!$M$19:$N$45,2,FALSE))","v":0},{"$f":"IF(ISNA(VLOOKUP($A24,Loop2!$M$19:$N$45,2,FALSE)),0,VLOOKUP($A24,Loop2!$M$19:$N$45,2,FALSE))","v":0},{"$f":"IF(ISNA(VLOOKUP($A24,Loop3!$M$19:$N$45,2,FALSE)),0,VLOOKUP($A24,Loop3!$M$19:$N$45,2,FALSE))","v":0},{"$f":"IF(ISNA(VLOOKUP($A24,Loop4!$M$19:$N$45,2,FALSE)),0,VLOOKUP($A24,Loop4!$M$19:$N$45,2,FALSE))","v":0},0]
["Wireless Combined Visual Indicator - Multisensor",{"$f":"IF(ISNA(VLOOKUP($A25,Loop1!$M$19:$N$45,2,FALSE)),0,VLOOKUP($A25,Loop1!$M$19:$N$45,2,FALSE))","v":0},{"$f":"IF(ISNA(VLOOKUP($A25,Loop2!$M$19:$N$45,2,FALSE)),0,VLOOKUP($A25,Loop2!$M$19:$N$45,2,FALSE))","v":0},{"$f":"IF(ISNA(VLOOKUP($A25,Loop3!$M$19:$N$45,2,FALSE)),0,VLOOKUP($A25,Loop3!$M$19:$N$45,2,FALSE))","v":0},{"$f":"IF(ISNA(VLOOKUP($A25,Loop4!$M$19:$N$45,2,FALSE)),0,VLOOKUP($A25,Loop4!$M$19:$N$45,2,FALSE))","v":0},0]
["Wireless Sounder",{"$f":"IF(ISNA(VLOOKUP($A26,Loop1!$M$19:$N$45,2,FALSE)),0,VLOOKUP($A26,Loop1!$M$19:$N$45,2,FALSE))","v":0},{"$f":"IF(ISNA(VLOOKUP($A26,Loop2!$M$19:$N$45,2,FALSE)),0,VLOOKUP($A26,Loop2!$M$19:$N$45,2,FALSE))","v":0},{"$f":"IF(ISNA(VLOOKUP($A26,Loop3!$M$19:$N$45,2,FALSE)),0,VLOOKUP($A26,Loop3!$M$19:$N$45,2,FALSE))","v":0},{"$f":"IF(ISNA(VLOOKUP($A26,Loop4!$M$19:$N$45,2,FALSE)),0,VLOOKUP($A26,Loop4!$M$19:$N$45,2,FALSE))","v":0},0]
["Wireless Sounder Beacon",{"$f":"IF(ISNA(VLOOKUP($A27,Loop1!$M$19:$N$45,2,FALSE)),0,VLOOKUP($A27,Loop1!$M$19:$N$45,2,FALSE))","v":0},{"$f":"IF(ISNA(VLOOKUP($A27,Loop2!$M$19:$N$45,2,FALSE)),0,VLOOKUP($A27,Loop2!$M$19:$N$45,2,FALSE))","v":0},{"$f":"IF(ISNA(VLOOKUP($A27,Loop3!$M$19:$N$45,2,FALSE)),0,VLOOKUP($A27,Loop3!$M$19:$N$45,2,FALSE))","v":0},{"$f":"IF(ISNA(VLOOKUP($A27,Loop4!$M$19:$N$45,2,FALSE)),0,VLOOKUP($A27,Loop4!$M$19:$N$45,2,FALSE))","v":0},0]
["Wireless Beacon",{"$f":"IF(ISNA(VLOOKUP($A28,Loop1!$M$19:$N$45,2,FALSE)),0,VLOOKUP($A28,Loop1!$M$19:$N$45,2,FALSE))","v":0},{"$f":"IF(ISNA(VLOOKUP($A28,Loop2!$M$19:$N$45,2,FALSE)),0,VLOOKUP($A28,Loop2!$M$19:$N$45,2,FALSE))","v":0},{"$f":"IF(ISNA(VLOOKUP($A28,Loop3!$M$19:$N$45,2,FALSE)),0,VLOOKUP($A28,Loop3!$M$19:$N$45,2,FALSE))","v":0},{"$f":"IF(ISNA(VLOOKUP($A28,Loop4!$M$19:$N$45,2,FALSE)),0,VLOOKUP($A28,Loop4!$M$19:$N$45,2,FALSE))","v":0},0]
["Wireless Weather Resistant Sounder",{"$f":"IF(ISNA(VLOOKUP($A29,Loop1!$M$19:$N$45,2,FALSE)),0,VLOOKUP($A29,Loop1!$M$19:$N$45,2,FALSE))","v":0},{"$f":"IF(ISNA(VLOOKUP($A29,Loop2!$M$19:$N$45,2,FALSE)),0,VLOOKUP($A29,Loop2!$M$19:$N$45,2,FALSE))","v":0},{"$f":"IF(ISNA(VLOOKUP($A29,Loop3!$M$19:$N$45,2,FALSE)),0,VLOOKUP($A29,Loop3!$M$19:$N$45,2,FALSE))","v":0},{"$f":"IF(ISNA(VLOOKUP($A29,Loop4!$M$19:$N$45,2,FALSE)),0,VLOOKUP($A29,Loop4!$M$19:$N$45,2,FALSE))","v":0},0]
["Wireless Weather Resistant Sounder Beacon",{"$f":"IF(ISNA(VLOOKUP($A30,Loop1!$M$19:$N$45,2,FALSE)),0,VLOOKUP($A30,Loop1!$M$19:$N$45,2,FALSE))","v":0},{"$f":"IF(ISNA(VLOOKUP($A30,Loop2!$M$19:$N$45,2,FALSE)),0,VLOOKUP($A30,Loop2!$M$19:$N$45,2,FALSE))","v":0},{"$f":"IF(ISNA(VLOOKUP($A30,Loop3!$M$19:$N$45,2,FALSE)),0,VLOOKUP($A30,Loop3!$M$19:$N$45,2,FALSE))","v":0},{"$f":"IF(ISNA(VLOOKUP($A30,Loop4!$M$19:$N$45,2,FALSE)),0,VLOOKUP($A30,Loop4!$M$19:$N$45,2,FALSE))","v":0},0]
{"$rows_left_out":7}
{"sheet":"Help","index":7,"n_rows":111,"n_cols":2,"rows_kept":111,"cut":false,"hidden":true,"merged":[[2,0,2,11]]}
[]
[]
["How to Fill in the Firecell System Address Schedule"]
[]
["Step 1. Familiarise yourself with the information required to be added into the relevant fields of the schedule"]
[]
[]
[]
[]
[]
[]
[]
[]
[]
[]
[]
[]
[]
[]
[]
[]
[]
[]
[]
[]
[]
[]
[]
[]
[]
{"$rows_left_out":82}
{"sheet":"Parameters","index":8,"n_rows":18,"n_cols":10,"rows_kept":18,"cut":false,"hidden":true,"merged":[]}
["Named Range: DeviceList [Care To Be Taken When Changing This Range]",null,"Parameter","Value","Date","Comments",null,"Parameter","Value","Comments"]
["Wireless Radio Cluster Communicator",null,"Current Version",{"$f":"MAX(D3:D741)","v":5},{"$f":"MAX(E3:E741)","v":"2018-07-25"},"Current Version deployed",null,"HelpOrigin","Loop1","Sheet Name That The Help Button Was Pressed From"]
["Wireless Radio HUB",null,"Version",1,"2017-11-29","Initial Release after Alpha Testing.\nBased On Ver 13 of the Full Address Schedule Spreadsheet."]
["Wireless Call Point",null,"Verison",2,"2017-12-18","Added MACRO MUST BE ENABLED To Loop 1 Sheet Cell G1"]
["Wireless Optical Detector",null,"Version",3,"2018-01-25","Added Macro Enable Landing Page. Added Site Details Page. Modified Print Areas and re-formatted sheet to enable easier interpritaion of data when printed. "]
["Wireless Heat Detector CS",null,"Version",4,"2018-05-03","Resequenced Device List:\nWireless Radio Cluster Communicator\nWireless Radio HUB\nplaced at top of dropdown list"]
["Wireless Heat Detector A1R",null,"Version",5,"2018-07-25","Added Additional Code To Ensure The 'Enter loop Info' Button has focus when a user has entered the address schedule info"]
["Wireless Multisensor"]
["Wireless Input Output Unit"]
["Wireless Combined Detector Sounder"]
["Wireless Combined Detector Sounder - Visual Indicator"]
["Wireless Sounder"]
["Wireless Sounder Beacon"]
["Wireless Beacon"]
["Wireless Weather Resistant Sounder"]
["Wireless Weather Resistant Sounder Beacon"]
["Wireless Weather Resistant Beacon"]
["Wireless Remote Indicator"]